Reaction Details
TargetCathepsin K
LigandBDBM50318882
Substrate/Competitorn/a
Meas. Tech.ChEMBL_633770 (CHEMBL1119720)
Ki 4.8±n/a nM
Citation Allen, JGFotsch, CBabij, P Emerging targets in osteoporosis disease modification. J Med Chem53:4332-53 (2010) 
 
Cathepsin K
Name:Cathepsin K
Type:Enzyme
Mol. Mass.:36975.68
Organism:Homo sapiens (Human)
Description:P43235
Residue:329
BDBM50318882
NameBDBM50318882
Synonyms:4-(2-(4-methylpiperazin-1-yl)thiazol-4-yl)-N-(1-((3S,4R)-2-oxo-4-phenoxyazetidin-3-ylcarbamoyl)cyclohexyl)benzamide CHEMBL367800
TypeSmall organic molecule
Emp. Form.C31H36N6O4S
Mol. Mass.588.72
SMILESCN1CCN(CC1)c1nc(cs1)-c1ccc(cc1)C(=O)NC1(CCCCC1)C(=O)N[C@H]1[C@H](NC1=O)Oc1ccccc1