Reaction Details
TargetCathepsin K
LigandBDBM50318883
Substrate/Competitorn/a
Meas. Tech.ChEMBL_633770 (CHEMBL1119720)
IC50 34.5±n/a nM
Citation Allen, JGFotsch, CBabij, P Emerging targets in osteoporosis disease modification. J Med Chem53:4332-53 (2010) 
 
Cathepsin K
Name:Cathepsin K
Type:Enzyme
Mol. Mass.:36975.68
Organism:Homo sapiens (Human)
Description:P43235
Residue:329
BDBM50318883
NameBDBM50318883
Synonyms:CHEMBL1085282 sodium(2S,3S)-3-((S)-1-isobutoxy-4-methylpentan-2-ylcarbamoyl)oxirane-2-carboxylate
TypeSmall organic molecule
Emp. Form.C14H24NO5
Mol. Mass.286.3446
SMILESCC(C)COC[C@H](CC(C)C)NC(=O)[C@H]1O[C@@H]1C([O-])=O