Reaction Details
TargetParathyroid hormone/parathyroid hormone-related peptide receptor
LigandBDBM50318886
Substrate/Competitorn/a
Meas. Tech.ChEMBL_633354 (CHEMBL1120574)
EC50 3200±n/a nM
Citation Allen, JGFotsch, CBabij, P Emerging targets in osteoporosis disease modification. J Med Chem53:4332-53 (2010) 
 
Parathyroid hormone/parathyroid hormone-related peptide receptor
Name:Parathyroid hormone/parathyroid hormone-related peptide receptor
Type:Enzyme Catalytic Domain
Mol. Mass.:66370.95
Organism:Homo sapiens (Human)
Description:PARATHYROID HT1 0 HUMAN::Q03431
Residue:593
BDBM50318886
NameBDBM50318886
Synonyms:1,3-dibutyl-5-(diaminomethylene)pyrimidine-2,4,6(1H,3H,5H)-trione | CHEMBL1084168
TypeSmall organic molecule
Emp. Form.C13H22N4O3
Mol. Mass.282.3388
SMILESCCCCN1C(=O)C(C(N)=N)C(=O)N(CCCC)C1=O