Reaction Details
TargetNeuromedin-K receptor
LigandBDBM50318918
Substrate/Competitorn/a
Meas. Tech.ChEMBL_635274 (CHEMBL1118378)
Ki 6.87±n/a nM
Citation Peters, JUHoffmann, TSchnider, PStadler, HKoblet, AAlker, APoli, SMBallard, TMSpooren, WSteward, LSleight, AJ Discovery of potent, balanced and orally active dual NK1/NK3 receptor ligands. Bioorg Med Chem Lett20:3405-8 (2010) 
 
Neuromedin-K receptor
Name:Neuromedin-K receptor
Type:Enzyme
Mol. Mass.:52221.96
Organism:Homo sapiens (Human)
Description:P29371
Residue:465
BDBM50318918
NameBDBM50318918
Synonyms:2-(3,5-bis(trifluoromethyl)phenyl)-N-(4-(2-chlorophenyl)-6-((R)-3-hydroxypyrrolidin-1-yl)pyridin-3-yl)-N,2-dimethylpropanamide | CHEMBL1084771
TypeSmall organic molecule
Emp. Form.C28H26ClF6N3O2
Mol. Mass.585.968
SMILESCN(C(=O)C(C)(C)c1cc(cc(c1)C(F)(F)F)C(F)(F)F)c1cnc(cc1-c1ccccc1Cl)N1CC[C@@H](O)C1