Reaction Details
TargetBeta-2 adrenergic receptor
LigandBDBM50318990
Substrate/Competitorn/a
Meas. Tech.ChEMBL_635468 (CHEMBL1120618)
Ki 0.300000±n/a nM
Citation Tasler, SBaumgartner, RAschenbrenner, AAmmendola, AWolf, KWieber, TSchachtner, JBlisse, MQuotschalla, UNey, P A vHTS approach for the identification of beta-adrenoceptor ligands. Bioorg Med Chem Lett20:3399-404 (2010) 
 
Beta-2 adrenergic receptor
Name:Beta-2 adrenergic receptor
Type:n/a
Mol. Mass.:46461.69
Organism:Homo sapiens (Human)
Description:P07550
Residue:413
BDBM50318990
NameBDBM50318990
Synonyms:(1-(3-(9H-carbazol-4-yloxy)-2-hydroxypropyl)piperidin-4-yl)(4-fluorophenyl)methanone | CHEMBL1086077
TypeSmall organic molecule
Emp. Form.C27H27FN2O3
Mol. Mass.446.5133
SMILESOC(COc1cccc2[nH]c3ccccc3c12)CN1CCC(CC1)C(=O)c1ccc(F)cc1