Reaction Details
TargetBeta-3 adrenergic receptor
LigandBDBM50318979
Substrate/Competitorn/a
Meas. Tech.ChEMBL_635476 (CHEMBL1117710)
Ki 1770±n/a nM
Citation Tasler, SBaumgartner, RAschenbrenner, AAmmendola, AWolf, KWieber, TSchachtner, JBlisse, MQuotschalla, UNey, P A vHTS approach for the identification of beta-adrenoceptor ligands. Bioorg Med Chem Lett20:3399-404 (2010) 
 
Beta-3 adrenergic receptor
Name:Beta-3 adrenergic receptor
Type:G Protein-Coupled Receptor (GPCR)
Mol. Mass.:43534.88
Organism:Homo sapiens (Human)
Description:n/a
Residue:408
BDBM50318979
NameBDBM50318979
Synonyms:1-(2-isopropylphenoxy)-3-morpholinopropan-2-ol | CHEMBL1083668
TypeSmall organic molecule
Emp. Form.C16H25NO3
Mol. Mass.279.3746
SMILESCC(C)c1ccccc1OCC(O)CN1CCOCC1