Reaction Details
TargetBeta-1 adrenergic receptor
LigandBDBM50318990
Substrate/Competitorn/a
Meas. Tech.ChEMBL_635470 (CHEMBL1120620)
EC50 310±n/a nM
Citation Tasler, SBaumgartner, RAschenbrenner, AAmmendola, AWolf, KWieber, TSchachtner, JBlisse, MQuotschalla, UNey, P A vHTS approach for the identification of beta-adrenoceptor ligands. Bioorg Med Chem Lett20:3399-404 (2010) 
 
Beta-1 adrenergic receptor
Name:Beta-1 adrenergic receptor
Type:G Protein-Coupled Receptor (GPCR)
Mol. Mass.:51338.40
Organism:Homo sapiens (Human)
Description:P08588
Residue:477
BDBM50318990
NameBDBM50318990
Synonyms:(1-(3-(9H-carbazol-4-yloxy)-2-hydroxypropyl)piperidin-4-yl)(4-fluorophenyl)methanone | CHEMBL1086077
TypeSmall organic molecule
Emp. Form.C27H27FN2O3
Mol. Mass.446.5133
SMILESOC(COc1cccc2[nH]c3ccccc3c12)CN1CCC(CC1)C(=O)c1ccc(F)cc1