Reaction Details
TargetBeta-3 adrenergic receptor
LigandBDBM50318999
Substrate/Competitorn/a
Meas. Tech.ChEMBL_635476 (CHEMBL1117710)
Ki 225±n/a nM
Citation Tasler, SBaumgartner, RAschenbrenner, AAmmendola, AWolf, KWieber, TSchachtner, JBlisse, MQuotschalla, UNey, P A vHTS approach for the identification of beta-adrenoceptor ligands. Bioorg Med Chem Lett20:3399-404 (2010) 
 
Beta-3 adrenergic receptor
Name:Beta-3 adrenergic receptor
Type:G Protein-Coupled Receptor (GPCR)
Mol. Mass.:43534.88
Organism:Homo sapiens (Human)
Description:n/a
Residue:408
BDBM50318999
NameBDBM50318999
Synonyms:2-((1-(3-(9H-carbazol-4-yloxy)-2-hydroxypropyl)piperidin-4-yl)methyl)-1H-benzo[de]isoquinoline-1,3(2H)-dione | CHEMBL1084772
TypeSmall organic molecule
Emp. Form.C33H31N3O4
Mol. Mass.533.6169
SMILESOC(COc1cccc2[nH]c3ccccc3c12)CN1CCC(CN2C(=O)c3cccc4cccc(C2=O)c34)CC1