Reaction Details
TargetRho-associated protein kinase 1
LigandBDBM50319021
Substrate/Competitorn/a
Meas. Tech.ChEMBL_635486 (CHEMBL1117720)
IC50 20±n/a nM
Citation Davis, RLKahraman, MPrins, TJBeaver, YCook, TGCramp, JCayanan, CSGardiner, EMMcLaughlin, MAClark, AFHellberg, MRShiau, AKNoble, SABorchardt, AJ Benzothiophene containing Rho kinase inhibitors: Efficacy in an animal model of glaucoma. Bioorg Med Chem Lett20:3361-6 (2010) 
 
Rho-associated protein kinase 1
Name:Rho-associated protein kinase 1
Type:Serine/threonine-protein kinase
Mol. Mass.:158156.77
Organism:Homo sapiens (Human)
Description:Q13464
Residue:1354
BDBM50319021
NameBDBM50319021
Synonyms:3-((2-(2-aminopyrimidin-4-yl)-3-methylbenzo[b]thiophen-5-yl)methyl)phenol | CHEMBL1082758
TypeSmall organic molecule
Emp. Form.C20H17N3OS
Mol. Mass.347.433
SMILESCc1c(sc2ccc(Cc3cccc(O)c3)cc12)-c1ccnc(N)n1