Reaction Details
TargetRho-associated protein kinase 1
LigandBDBM50319022
Substrate/Competitorn/a
Meas. Tech.ChEMBL_635486 (CHEMBL1117720)
IC50 60±n/a nM
Citation Davis, RLKahraman, MPrins, TJBeaver, YCook, TGCramp, JCayanan, CSGardiner, EMMcLaughlin, MAClark, AFHellberg, MRShiau, AKNoble, SABorchardt, AJ Benzothiophene containing Rho kinase inhibitors: Efficacy in an animal model of glaucoma. Bioorg Med Chem Lett20:3361-6 (2010) 
 
Rho-associated protein kinase 1
Name:Rho-associated protein kinase 1
Type:Serine/threonine-protein kinase
Mol. Mass.:158156.77
Organism:Homo sapiens (Human)
Description:Q13464
Residue:1354
BDBM50319022
NameBDBM50319022
Synonyms:3-((2-(2-aminopyrimidin-4-yl)-3-methylbenzo[b]thiophen-5-yl)methyl)benzoic acid | CHEMBL1084791
TypeSmall organic molecule
Emp. Form.C21H17N3O2S
Mol. Mass.375.444
SMILESCc1c(sc2ccc(Cc3cccc(c3)C(O)=O)cc12)-c1ccnc(N)n1