Reaction Details
TargetRho-associated protein kinase 1
LigandBDBM50319026
Substrate/Competitorn/a
Meas. Tech.ChEMBL_635486 (CHEMBL1117720)
IC50 20±n/a nM
Citation Davis, RLKahraman, MPrins, TJBeaver, YCook, TGCramp, JCayanan, CSGardiner, EMMcLaughlin, MAClark, AFHellberg, MRShiau, AKNoble, SABorchardt, AJ Benzothiophene containing Rho kinase inhibitors: Efficacy in an animal model of glaucoma. Bioorg Med Chem Lett20:3361-6 (2010) 
 
Rho-associated protein kinase 1
Name:Rho-associated protein kinase 1
Type:Serine/threonine-protein kinase
Mol. Mass.:158156.77
Organism:Homo sapiens (Human)
Description:Q13464
Residue:1354
BDBM50319026
NameBDBM50319026
Synonyms:(+/-)-4-(5-(amino(3-methoxyphenyl)methyl)-3-methylbenzo[b]thiophen-2-yl)pyrimidin-2-amine | CHEMBL1083073
TypeSmall organic molecule
Emp. Form.C21H20N4OS
Mol. Mass.376.475
SMILESCOc1cccc(c1)C(N)c1ccc2sc(c(C)c2c1)-c1ccnc(N)n1