Reaction Details
TargetRho-associated protein kinase 1
LigandBDBM50319020
Substrate/Competitorn/a
Meas. Tech.ChEMBL_635489 (CHEMBL1117723)
EC50>10000±n/a nM
Citation Davis, RLKahraman, MPrins, TJBeaver, YCook, TGCramp, JCayanan, CSGardiner, EMMcLaughlin, MAClark, AFHellberg, MRShiau, AKNoble, SABorchardt, AJ Benzothiophene containing Rho kinase inhibitors: Efficacy in an animal model of glaucoma. Bioorg Med Chem Lett20:3361-6 (2010) 
 
Rho-associated protein kinase 1
Name:Rho-associated protein kinase 1
Type:Serine/threonine-protein kinase
Mol. Mass.:158156.77
Organism:Homo sapiens (Human)
Description:Q13464
Residue:1354
BDBM50319020
NameBDBM50319020
Synonyms:4-(3-methyl-5-(3-(trifluoromethyl)benzyl)benzo[b]thiophen-2-yl)pyrimidin-2-amine | CHEMBL1082757
TypeSmall organic molecule
Emp. Form.C21H16F3N3S
Mol. Mass.399.432
SMILESCc1c(sc2ccc(Cc3cccc(c3)C(F)(F)F)cc12)-c1ccnc(N)n1