Reaction Details
TargetRho-associated protein kinase 1
LigandBDBM50319023
Substrate/Competitorn/a
Meas. Tech.ChEMBL_635489 (CHEMBL1117723)
EC50>10000±n/a nM
Citation Davis, RLKahraman, MPrins, TJBeaver, YCook, TGCramp, JCayanan, CSGardiner, EMMcLaughlin, MAClark, AFHellberg, MRShiau, AKNoble, SABorchardt, AJ Benzothiophene containing Rho kinase inhibitors: Efficacy in an animal model of glaucoma. Bioorg Med Chem Lett20:3361-6 (2010) 
 
Rho-associated protein kinase 1
Name:Rho-associated protein kinase 1
Type:Serine/threonine-protein kinase
Mol. Mass.:158156.77
Organism:Homo sapiens (Human)
Description:Q13464
Residue:1354
BDBM50319023
NameBDBM50319023
Synonyms:CHEMBL1084792 | methyl 3-((2-(2-aminopyrimidin-4-yl)-3-methylbenzo[b]thiophen-5-yl)methyl)benzoate
TypeSmall organic molecule
Emp. Form.C22H19N3O2S
Mol. Mass.389.47
SMILESCOC(=O)c1cccc(Cc2ccc3sc(c(C)c3c2)-c2ccnc(N)n2)c1