Reaction Details
TargetP2Y purinoceptor 4
LigandBDBM50319143
Substrate/Competitorn/a
Meas. Tech.ChEMBL_635652 (CHEMBL1119544)
EC50 50±n/a nM
Citation Maruoka, HBarrett, MOKo, HTosh, DKMelman, ABurianek, LEBalasubramanian, RBerk, BCostanzi, SHarden, TKJacobson, KA Pyrimidine ribonucleotides with enhanced selectivity as P2Y(6) receptor agonists: novel 4-alkyloxyimino, (S)-methanocarba, and 5'-triphosphate gamma-ester modifications. J Med Chem53:4488-501 (2010) 
 
P2Y purinoceptor 4
Name:P2Y purinoceptor 4
Type:PROTEIN
Mol. Mass.:40977.17
Organism:Homo sapiens (Human)
Description:ChEMBL_751027
Residue:365
BDBM50319143
NameBDBM50319143
Synonyms:CHEMBL1083764 N4-Methoxycytidine 5'-Triphosphate triethylammonium Salt
TypeSmall organic molecule
Emp. Form.C10H18N3O15P3
Mol. Mass.513.1823
SMILESCONc1ccn([C@@H]2O[C@H](COP(O)(=O)OP(O)(=O)OP(O)(O)=O)[C@@H](O)[C@H]2O)c(=O)n1