Reaction Details
TargetP2Y purinoceptor 4
LigandBDBM50319144
Substrate/Competitorn/a
Meas. Tech.ChEMBL_635652 (CHEMBL1119544)
EC50 85±n/a nM
Citation Maruoka, HBarrett, MOKo, HTosh, DKMelman, ABurianek, LEBalasubramanian, RBerk, BCostanzi, SHarden, TKJacobson, KA Pyrimidine ribonucleotides with enhanced selectivity as P2Y(6) receptor agonists: novel 4-alkyloxyimino, (S)-methanocarba, and 5'-triphosphate gamma-ester modifications. J Med Chem53:4488-501 (2010) 
 
P2Y purinoceptor 4
Name:P2Y purinoceptor 4
Type:PROTEIN
Mol. Mass.:40977.17
Organism:Homo sapiens (Human)
Description:ChEMBL_751027
Residue:365
BDBM50319144
NameBDBM50319144
Synonyms:((1S,2S,4S,5S)-4-(2,4-dioxo-3,4-dihydropyrimidin-1(2H)-yl)-2-hydroxybicyclo[3.1.0]hexan-1-yl)methyl tetrahydrogen triphosphate | CHEMBL1083763
TypeSmall organic molecule
Emp. Form.C11H17N2O13P3
Mol. Mass.478.1796
SMILESO[C@H]1C[C@@H]([C@H]2C[C@]12COP(O)(=O)OP(O)(=O)OP(O)(O)=O)n1ccc(=O)[nH]c1=O