Reaction Details
TargetcAMP and cAMP-inhibited cGMP 3',5'-cyclic phosphodiesterase 10A
LigandBDBM50319146
Substrate/Competitorn/a
Meas. Tech.ChEMBL_635680 (CHEMBL1119709)
IC50 81±n/a nM
Citation Höfgen, NStange, HSchindler, RLankau, HJGrunwald, CLangen, BEgerland, UTremmel, PPangalos, MNMarquis, KLHage, THarrison, BLMalamas, MSBrandon, NJKronbach, T Discovery of imidazo[1,5-a]pyrido[3,2-e]pyrazines as a new class of phosphodiesterase 10A inhibitiors. J Med Chem53:4399-411 (2010) 
 
cAMP and cAMP-inhibited cGMP 3',5'-cyclic phosphodiesterase 10A
Name:cAMP and cAMP-inhibited cGMP 3',5'-cyclic phosphodiesterase 10A
Type:Protein
Mol. Mass.:88412.52
Organism:Homo sapiens (Human)
Description:Q9Y233
Residue:1055
BDBM50319146
NameBDBM50319146
Synonyms:8-Methoxy-1,3,4-trimethyl-imidazo[1,5-a]pyrido[3,2-e]pyrazine | CHEMBL1086107
TypeSmall organic molecule
Emp. Form.C13H14N4O
Mol. Mass.242.2765
SMILESCOc1ccc2nc(C)c3c(C)nc(C)n3c2n1