Reaction Details
TargetcAMP-specific 3',5'-cyclic phosphodiesterase 7B
LigandBDBM50319163
Substrate/Competitorn/a
Meas. Tech.ChEMBL_635690 (CHEMBL1119719)
IC50>1000±n/a nM
Citation Höfgen, NStange, HSchindler, RLankau, HJGrunwald, CLangen, BEgerland, UTremmel, PPangalos, MNMarquis, KLHage, THarrison, BLMalamas, MSBrandon, NJKronbach, T Discovery of imidazo[1,5-a]pyrido[3,2-e]pyrazines as a new class of phosphodiesterase 10A inhibitiors. J Med Chem53:4399-411 (2010) 
 
cAMP-specific 3',5'-cyclic phosphodiesterase 7B
Name:cAMP-specific 3',5'-cyclic phosphodiesterase 7B
Type:Enzyme
Mol. Mass.:51842.76
Organism:Homo sapiens (Human)
Description:Q9NP56
Residue:450
BDBM50319163
NameBDBM50319163
Synonyms:8-Methoxy-3-methyl-4-methylsulfonylamino-1-propyl-imidazo[1,5-a]pyrido[3,2-e]pyrazine | CHEMBL1085374
TypeSmall organic molecule
Emp. Form.C15H19N5O3S
Mol. Mass.349.408
SMILESCCCc1nc(C)c2c(NS(C)(=O)=O)nc3ccc(OC)nc3n12