Reaction Details
TargetProstaglandin D2 receptor 2
LigandBDBM50319493
Substrate/Competitorn/a
Meas. Tech.ChEMBL_634231 (CHEMBL1120178)
Ki 1400±n/a nM
Citation Tumey, LNRobarge, MJGleason, ESong, JMurphy, SMEkema, GDoucette, CHanniford, DPalmer, MPawlowski, GDanzig, JLoftus, MHunady, KSherf, BMays, RWStricker-Krongrad, ABrunden, KRBennani, YLHarrington, JJ 3-Indolyl sultams as selective CRTh2 antagonists. Bioorg Med Chem Lett20:3287-90 (2010) 
 
Prostaglandin D2 receptor 2
Name:Prostaglandin D2 receptor 2
Type:Enzyme
Mol. Mass.:43295.45
Organism:Homo sapiens (Human)
Description:Q9Y5Y4
Residue:395
BDBM50319493
NameBDBM50319493
Synonyms:CHEMBL1086537 | rac-{3-[2-(2-Hydroxy-ethyl)-1,1-dioxo-2,3-dihydro-1H-1lambda*6*-benzo[d]isothiazol-3-yl]-2-methyl-indol-1-yl}-acetic acid
TypeSmall organic molecule
Emp. Form.C20H20N2O5S
Mol. Mass.400.448
SMILESCc1c(C2N(CCO)S(=O)(=O)c3ccccc23)c2ccccc2n1CC(O)=O