Reaction Details
TargetProstaglandin D2 receptor 2
LigandBDBM50319497
Substrate/Competitorn/a
Meas. Tech.ChEMBL_634231 (CHEMBL1120178)
Ki 2900±n/a nM
Citation Tumey, LNRobarge, MJGleason, ESong, JMurphy, SMEkema, GDoucette, CHanniford, DPalmer, MPawlowski, GDanzig, JLoftus, MHunady, KSherf, BMays, RWStricker-Krongrad, ABrunden, KRBennani, YLHarrington, JJ 3-Indolyl sultams as selective CRTh2 antagonists. Bioorg Med Chem Lett20:3287-90 (2010) 
 
Prostaglandin D2 receptor 2
Name:Prostaglandin D2 receptor 2
Type:Enzyme
Mol. Mass.:43295.45
Organism:Homo sapiens (Human)
Description:Q9Y5Y4
Residue:395
BDBM50319497
NameBDBM50319497
Synonyms:CHEMBL1083734 | rac-[3-(1,1-Dioxo-2,3-dihydro-1H-1lambda*6*-benzo[d]isothiazol-3-yl)-5-methyl-indol-1-yl]-acetic acid
TypeSmall organic molecule
Emp. Form.C18H16N2O4S
Mol. Mass.356.396
SMILESCc1ccc2n(CC(O)=O)cc(C3NS(=O)(=O)c4ccccc34)c2c1