Reaction Details
TargetProstaglandin D2 receptor 2
LigandBDBM50319481
Substrate/Competitorn/a
Meas. Tech.ChEMBL_634231 (CHEMBL1120178)
Ki 630±n/a nM
Citation Tumey, LNRobarge, MJGleason, ESong, JMurphy, SMEkema, GDoucette, CHanniford, DPalmer, MPawlowski, GDanzig, JLoftus, MHunady, KSherf, BMays, RWStricker-Krongrad, ABrunden, KRBennani, YLHarrington, JJ 3-Indolyl sultams as selective CRTh2 antagonists. Bioorg Med Chem Lett20:3287-90 (2010) 
 
Prostaglandin D2 receptor 2
Name:Prostaglandin D2 receptor 2
Type:Enzyme
Mol. Mass.:43295.45
Organism:Homo sapiens (Human)
Description:Q9Y5Y4
Residue:395
BDBM50319481
NameBDBM50319481
Synonyms:CHEMBL1085639 | rac-[3-(1,1-Dioxo-2-phenethyl-2,3-dihydro-1H-1lambda*6*-benzo[d]isothiazol-3-yl)-indol-1-yl]-acetic acid
TypeSmall organic molecule
Emp. Form.C25H22N2O4S
Mol. Mass.446.518
SMILESOC(=O)Cn1cc(C2N(CCc3ccccc3)S(=O)(=O)c3ccccc23)c2ccccc12