Reaction Details
TargetThromboxane A2 receptor
LigandBDBM50319491
Substrate/Competitorn/a
Meas. Tech.ChEMBL_634234 (CHEMBL1120181)
Ki 3400±n/a nM
Citation Tumey, LNRobarge, MJGleason, ESong, JMurphy, SMEkema, GDoucette, CHanniford, DPalmer, MPawlowski, GDanzig, JLoftus, MHunady, KSherf, BMays, RWStricker-Krongrad, ABrunden, KRBennani, YLHarrington, JJ 3-Indolyl sultams as selective CRTh2 antagonists. Bioorg Med Chem Lett20:3287-90 (2010) 
 
Thromboxane A2 receptor
Name:Thromboxane A2 receptor
Type:Enyzme
Mol. Mass.:37445.28
Organism:Homo sapiens (Human)
Description:P21731
Residue:343
BDBM50319491
NameBDBM50319491
Synonyms:CHEMBL1083446 | rac-(3-{2-[2-(4-Chloro-phenoxy)-ethyl]-1,1-dioxo-2,3-dihydro-1H-1lambda*6*-benzo[d]isothiazol-3-yl}-2-methyl-indol-1-yl)-acetic acid
TypeSmall organic molecule
Emp. Form.C26H23ClN2O5S
Mol. Mass.510.989
SMILESCc1c(C2N(CCOc3ccc(Cl)cc3)S(=O)(=O)c3ccccc23)c2ccccc2n1CC(O)=O