Reaction Details
TargetHistamine H3 receptor
LigandBDBM50319508
Substrate/Competitorn/a
Meas. Tech.ChEMBL_634304 (CHEMBL1120717)
Ki 0.19±n/a nM
Citation Liu, HAltenbach, RJDiaz, GJManelli, AMMartin, RLMiller, TREsbenshade, TABrioni, JDCowart, MD In vitro studies on a class of quinoline containing histamine H3 antagonists. Bioorg Med Chem Lett20:3295-300 (2010) 
 
Histamine H3 receptor
Name:Histamine H3 receptor
Type:G Protein-Coupled Receptor (GPCR)
Mol. Mass.:48691.47
Organism:Homo sapiens (Human)
Description:Binding assays were using CHO cells stably expressing hH3R receptors.
Residue:445
BDBM50319508
NameBDBM50319508
Synonyms:(R)-2,4-dimethyl-5-(6-(2-(2-methylpyrrolidin-1-yl)ethyl)quinolin-2-yl)thiazole | CHEMBL1084559
TypeSmall organic molecule
Emp. Form.C21H25N3S
Mol. Mass.351.508
SMILESC[C@@H]1CCCN1CCc1ccc2nc(ccc2c1)-c1sc(C)nc1C