Reaction Details
TargetHistamine H3 receptor
LigandBDBM50319513
Substrate/Competitorn/a
Meas. Tech.ChEMBL_634304 (CHEMBL1120717)
Ki 0.36±n/a nM
Citation Liu, HAltenbach, RJDiaz, GJManelli, AMMartin, RLMiller, TREsbenshade, TABrioni, JDCowart, MD In vitro studies on a class of quinoline containing histamine H3 antagonists. Bioorg Med Chem Lett20:3295-300 (2010) 
 
Histamine H3 receptor
Name:Histamine H3 receptor
Type:G Protein-Coupled Receptor (GPCR)
Mol. Mass.:48691.47
Organism:Homo sapiens (Human)
Description:Binding assays were using CHO cells stably expressing hH3R receptors.
Residue:445
BDBM50319513
NameBDBM50319513
Synonyms:(R)-2-(2,6-dimethylpyridin-3-yl)-6-(2-(2-methylpyrrolidin-1-yl)ethyl)quinoline | CHEMBL1082447
TypeSmall organic molecule
Emp. Form.C23H27N3
Mol. Mass.345.4806
SMILESC[C@@H]1CCCN1CCc1ccc2nc(ccc2c1)-c1ccc(C)nc1C