Reaction Details
TargetPotassium voltage-gated channel subfamily H member 2
LigandBDBM50319544
Substrate/Competitorn/a
Meas. Tech.ChEMBL_634306 (CHEMBL1120719)
Ki 1500±n/a nM
Citation Liu, HAltenbach, RJDiaz, GJManelli, AMMartin, RLMiller, TREsbenshade, TABrioni, JDCowart, MD In vitro studies on a class of quinoline containing histamine H3 antagonists. Bioorg Med Chem Lett20:3295-300 (2010) 
 
Potassium voltage-gated channel subfamily H member 2
Name:Potassium voltage-gated channel subfamily H member 2
Type:Multi-pass membrane protein
Mol. Mass.:126672.65
Organism:Homo sapiens (Human)
Description:Q12809
Residue:1159
BDBM50319544
NameBDBM50319544
Synonyms:(R)-4-methyl-5-(6-(2-(2-methylpyrrolidin-1-yl)ethyl)quinolin-2-yl)-2-(pyridin-3-yl)thiazole | CHEMBL1082606
TypeSmall organic molecule
Emp. Form.C25H26N4S
Mol. Mass.414.566
SMILESC[C@@H]1CCCN1CCc1ccc2nc(ccc2c1)-c1sc(nc1C)-c1cccnc1