Reaction Details
TargetHistamine H3 receptor
LigandBDBM50224190
Substrate/Competitorn/a
Meas. Tech.ChEMBL_634304 (CHEMBL1120717)
Ki 0.45±n/a nM
Citation Liu, HAltenbach, RJDiaz, GJManelli, AMMartin, RLMiller, TREsbenshade, TABrioni, JDCowart, MD In vitro studies on a class of quinoline containing histamine H3 antagonists. Bioorg Med Chem Lett20:3295-300 (2010) 
 
Histamine H3 receptor
Name:Histamine H3 receptor
Type:G Protein-Coupled Receptor (GPCR)
Mol. Mass.:48691.47
Organism:Homo sapiens (Human)
Description:Binding assays were using CHO cells stably expressing hH3R receptors.
Residue:445
BDBM50224190
NameBDBM50224190
Synonyms:(R)-2-(1,3-dimethyl-1H-pyrazol-4-yl)-6-(2-(2-methylpyrrolidin-1-yl)ethyl)quinoline | CHEMBL442242
TypeSmall organic molecule
Emp. Form.C21H26N4
Mol. Mass.334.4579
SMILESC[C@@H]1CCCN1CCc1ccc2nc(ccc2c1)-c1cn(C)nc1C