Reaction Details
TargetSodium-dependent noradrenaline transporter
LigandBDBM50319576
Substrate/Competitorn/a
Meas. Tech.ChEMBL_634326 (CHEMBL1120739)
IC50 5.1±n/a nM
Citation O'Neill, DJAdedoyin, AAlfinito, PDBray, JACosmi, SDeecher, DCFensome, AHarrison, JLeventhal, LMann, CMcComas, CCSullivan, NRSpangler, TBUveges, AJTrybulski, EJWhiteside, GTZhang, P Discovery of novel selective norepinephrine reuptake inhibitors: 4-[3-aryl-2,2-dioxido-2,1,3-benzothiadiazol-1(3H)-yl]-1-(methylamino)butan-2-ols (WYE-103231). J Med Chem53:4511-21 (2010) 
 
Sodium-dependent noradrenaline transporter
Name:Sodium-dependent noradrenaline transporter
Type:Multi-pass membrane protein
Mol. Mass.:69337.72
Organism:Homo sapiens (Human)
Description:P23975
Residue:617
BDBM50319576
NameBDBM50319576
Synonyms:4-(2,2-Dioxido-3-phenyl-2,1,3-benzothiadiazol-1(3H)-yl)-1-(methylamino)butan-2-one | CHEMBL1083392
TypeSmall organic molecule
Emp. Form.C17H18FN3O3S
Mol. Mass.363.407
SMILESCNCC(=O)CCN1c2ccccc2N(c2ccccc2F)S1(=O)=O