Reaction Details
TargetSodium-dependent noradrenaline transporter
LigandBDBM50319587
Substrate/Competitorn/a
Meas. Tech.ChEMBL_634326 (CHEMBL1120739)
IC50 7±n/a nM
Citation O'Neill, DJAdedoyin, AAlfinito, PDBray, JACosmi, SDeecher, DCFensome, AHarrison, JLeventhal, LMann, CMcComas, CCSullivan, NRSpangler, TBUveges, AJTrybulski, EJWhiteside, GTZhang, P Discovery of novel selective norepinephrine reuptake inhibitors: 4-[3-aryl-2,2-dioxido-2,1,3-benzothiadiazol-1(3H)-yl]-1-(methylamino)butan-2-ols (WYE-103231). J Med Chem53:4511-21 (2010) 
 
Sodium-dependent noradrenaline transporter
Name:Sodium-dependent noradrenaline transporter
Type:Multi-pass membrane protein
Mol. Mass.:69337.72
Organism:Homo sapiens (Human)
Description:P23975
Residue:617
BDBM50319587
NameBDBM50319587
Synonyms:CHEMBL1084042 | {3-[3-(2-Fluoro-phenyl)-2,2-dioxo-2,3-dihydro-2lambda*6*-benzo[1,2,5]thiadiazol-1-yl]-butyl}-methyl-amine
TypeSmall organic molecule
Emp. Form.C17H20FN3O2S
Mol. Mass.349.423
SMILESCNCCC(C)N1c2ccccc2N(c2ccccc2F)S1(=O)=O