Reaction Details
TargetSodium-dependent dopamine transporter
LigandBDBM50319578
Substrate/Competitorn/a
Meas. Tech.ChEMBL_634325 (CHEMBL1120738)
IC50 3617±n/a nM
Citation O'Neill, DJAdedoyin, AAlfinito, PDBray, JACosmi, SDeecher, DCFensome, AHarrison, JLeventhal, LMann, CMcComas, CCSullivan, NRSpangler, TBUveges, AJTrybulski, EJWhiteside, GTZhang, P Discovery of novel selective norepinephrine reuptake inhibitors: 4-[3-aryl-2,2-dioxido-2,1,3-benzothiadiazol-1(3H)-yl]-1-(methylamino)butan-2-ols (WYE-103231). J Med Chem53:4511-21 (2010) 
 
Sodium-dependent dopamine transporter
Name:Sodium-dependent dopamine transporter
Type:Multi-pass membrane protein
Mol. Mass.:68497.11
Organism:Homo sapiens (Human)
Description:Q01959
Residue:620
BDBM50319578
NameBDBM50319578
Synonyms:(2S)-(4-[3-(2-Fluorophenyl)-2,2-dioxido-2,1,3-benzothiadiazol-1(3H)-yl]-1-(methylamino)butan-2-ol | CHEMBL1082458
TypeSmall organic molecule
Emp. Form.C17H20FN3O3S
Mol. Mass.365.422
SMILESCNC[C@@H](O)CCN1c2ccccc2N(c2ccccc2F)S1(=O)=O