Reaction Details
TargetSodium-dependent noradrenaline transporter
LigandBDBM50319585
Substrate/Competitorn/a
Meas. Tech.ChEMBL_634327 (CHEMBL1120740)
IC50 9±n/a nM
Citation O'Neill, DJAdedoyin, AAlfinito, PDBray, JACosmi, SDeecher, DCFensome, AHarrison, JLeventhal, LMann, CMcComas, CCSullivan, NRSpangler, TBUveges, AJTrybulski, EJWhiteside, GTZhang, P Discovery of novel selective norepinephrine reuptake inhibitors: 4-[3-aryl-2,2-dioxido-2,1,3-benzothiadiazol-1(3H)-yl]-1-(methylamino)butan-2-ols (WYE-103231). J Med Chem53:4511-21 (2010) 
 
Sodium-dependent noradrenaline transporter
Name:Sodium-dependent noradrenaline transporter
Type:Multi-pass membrane protein
Mol. Mass.:69337.72
Organism:Homo sapiens (Human)
Description:P23975
Residue:617
BDBM50319585
NameBDBM50319585
Synonyms:(2R)-4-(2,2-Dioxido-3-phenyl-2,1,3-benzothiadiazol-1(3H)-yl)-1-(methylamino)butan-2-ol | CHEMBL1083408
TypeSmall organic molecule
Emp. Form.C17H21N3O3S
Mol. Mass.347.432
SMILESCNC[C@H](O)CCN1c2ccccc2N(c2ccccc2)S1(=O)=O