Reaction Details
TargetProtein kinase C epsilon type
LigandBDBM14029
Substrate/Competitorn/a
Meas. Tech.ChEMBL_634589 (CHEMBL1117930)
IC50 335±n/a nM
Citation Wu, FBüttner, FHChen, RHickey, EJakes, SKaplita, PKashem, MAKerr, SKugler, SPaw, ZProkopowicz, AShih, CKSnow, RYoung, ECywin, CL Substituted 2H-isoquinolin-1-one as potent Rho-Kinase inhibitors. Part 1: Hit-to-lead account. Bioorg Med Chem Lett20:3235-9 (2010) 
 
Protein kinase C epsilon type
Name:Protein kinase C epsilon type
Type:Enzyme
Mol. Mass.:83680.45
Organism:Homo sapiens (Human)
Description:The recombinant human PKC enzymes were produced using a baculovirus expression system in SF9 cells
Residue:737
BDBM14029
NameBDBM14029
Synonyms:(R)-TRANS-4-(1-AMINOETHYL)-N-(4-PYRIDYL) CYCLOHEXANECARBOXAMIDE US10183931, Y-27632 | Y-27632
TypeSmall organic molecule
Emp. Form.C14H21N3O
Mol. Mass.247.336
SMILES[H][C@@]1(CC[C@@]([H])(CC1)C(=O)Nc1ccncc1)[C@@H](C)N