Reaction Details
TargetRho-associated protein kinase 2
LigandBDBM50319642
Substrate/Competitorn/a
Meas. Tech.ChEMBL_634586 (CHEMBL1117927)
IC50>10000±n/a nM
Citation Wu, FBüttner, FHChen, RHickey, EJakes, SKaplita, PKashem, MAKerr, SKugler, SPaw, ZProkopowicz, AShih, CKSnow, RYoung, ECywin, CL Substituted 2H-isoquinolin-1-one as potent Rho-Kinase inhibitors. Part 1: Hit-to-lead account. Bioorg Med Chem Lett20:3235-9 (2010) 
 
Rho-associated protein kinase 2
Name:Rho-associated protein kinase 2
Type:Protein
Mol. Mass.:160885.43
Organism:Homo sapiens (Human)
Description:O75116
Residue:1388
BDBM50319642
NameBDBM50319642
Synonyms:CHEMBL1085344 | N-(1H-benzo[d][1,2,3]triazol-5-yl)-2-phenylacetamide
TypeSmall organic molecule
Emp. Form.C14H12N4O
Mol. Mass.252.2713
SMILESO=C(Cc1ccccc1)Nc1ccc2nn[nH]c2c1