Reaction Details
TargetMyotonin-protein kinase
LigandBDBM50319632
Substrate/Competitorn/a
Meas. Tech.ChEMBL_634590 (CHEMBL1117931)
IC50>8000±n/a nM
Citation Wu, FBüttner, FHChen, RHickey, EJakes, SKaplita, PKashem, MAKerr, SKugler, SPaw, ZProkopowicz, AShih, CKSnow, RYoung, ECywin, CL Substituted 2H-isoquinolin-1-one as potent Rho-Kinase inhibitors. Part 1: Hit-to-lead account. Bioorg Med Chem Lett20:3235-9 (2010) 
 
Myotonin-protein kinase
Name:Myotonin-protein kinase
Type:Enzyme Catalytic Domain
Mol. Mass.:69359.66
Organism:Homo sapiens (Human)
Description:gi_47059024
Residue:629
BDBM50319632
NameBDBM50319632
Synonyms:CHEMBL1084890 | N-(7-chloro-1-oxo-1,2-dihydroisoquinolin-6-yl)-2-phenylacetamide
TypeSmall organic molecule
Emp. Form.C17H13ClN2O2
Mol. Mass.312.75
SMILESClc1cc2c(cc[nH]c2=O)cc1NC(=O)Cc1ccccc1