Reaction Details
TargetRho-associated protein kinase 2
LigandBDBM50319635
Substrate/Competitorn/a
Meas. Tech.ChEMBL_634586 (CHEMBL1117927)
IC50 19±n/a nM
Citation Wu, FBüttner, FHChen, RHickey, EJakes, SKaplita, PKashem, MAKerr, SKugler, SPaw, ZProkopowicz, AShih, CKSnow, RYoung, ECywin, CL Substituted 2H-isoquinolin-1-one as potent Rho-Kinase inhibitors. Part 1: Hit-to-lead account. Bioorg Med Chem Lett20:3235-9 (2010) 
 
Rho-associated protein kinase 2
Name:Rho-associated protein kinase 2
Type:Protein
Mol. Mass.:160885.43
Organism:Homo sapiens (Human)
Description:O75116
Residue:1388
BDBM50319635
NameBDBM50319635
Synonyms:CHEMBL1084106 | N-(7-chloro-1-oxo-1,2-dihydroisoquinolin-6-yl)-2-(cyclopropylamino)-2-phenylacetamide
TypeSmall organic molecule
Emp. Form.C20H18ClN3O2
Mol. Mass.367.829
SMILESClc1cc2c(cc[nH]c2=O)cc1NC(=O)C(NC1CC1)c1ccccc1