Reaction Details
TargetRho-associated protein kinase 1
LigandBDBM50319637
Substrate/Competitorn/a
Meas. Tech.ChEMBL_634588 (CHEMBL1117929)
IC50 53±n/a nM
Citation Wu, FBüttner, FHChen, RHickey, EJakes, SKaplita, PKashem, MAKerr, SKugler, SPaw, ZProkopowicz, AShih, CKSnow, RYoung, ECywin, CL Substituted 2H-isoquinolin-1-one as potent Rho-Kinase inhibitors. Part 1: Hit-to-lead account. Bioorg Med Chem Lett20:3235-9 (2010) 
 
Rho-associated protein kinase 1
Name:Rho-associated protein kinase 1
Type:Serine/threonine-protein kinase
Mol. Mass.:158156.77
Organism:Homo sapiens (Human)
Description:Q13464
Residue:1354
BDBM50319637
NameBDBM50319637
Synonyms:2-(benzylamino)-N-(7-chloro-1-oxo-1,2-dihydroisoquinolin-6-yl)acetamide | CHEMBL1084900
TypeSmall organic molecule
Emp. Form.C18H16ClN3O2
Mol. Mass.341.792
SMILESClc1cc2c(cc[nH]c2=O)cc1NC(=O)CNCc1ccccc1