Reaction Details
TargetSerine/threonine-protein kinase N2
LigandBDBM50319634
Substrate/Competitorn/a
Meas. Tech.ChEMBL_634592 (CHEMBL1117933)
IC50 110±n/a nM
Citation Wu, FBüttner, FHChen, RHickey, EJakes, SKaplita, PKashem, MAKerr, SKugler, SPaw, ZProkopowicz, AShih, CKSnow, RYoung, ECywin, CL Substituted 2H-isoquinolin-1-one as potent Rho-Kinase inhibitors. Part 1: Hit-to-lead account. Bioorg Med Chem Lett20:3235-9 (2010) 
 
Serine/threonine-protein kinase N2
Name:Serine/threonine-protein kinase N2
Type:PROTEIN
Mol. Mass.:112029.78
Organism:Homo sapiens (Human)
Description:ChEMBL_1433151
Residue:984
BDBM50319634
NameBDBM50319634
Synonyms:CHEMBL1084892 | N-(7-chloro-1-oxo-1,2-dihydroisoquinolin-6-yl)-2-(methylamino)-2-phenylacetamide
TypeSmall organic molecule
Emp. Form.C18H16ClN3O2
Mol. Mass.341.792
SMILESCNC(C(=O)Nc1cc2cc[nH]c(=O)c2cc1Cl)c1ccccc1