Reaction Details
TargetNeuronal acetylcholine receptor subunit alpha-7
LigandBDBM50319932
Substrate/Competitorn/a
Meas. Tech.ChEMBL_635043 (CHEMBL1118594)
Ki 10.1±n/a nM
Citation Li, TBunnelle, WHRyther, KBAnderson, DJMalysz, JHelfrich, RGrønlien, JHHåkerud, MPeters, DSchrimpf, MRGopalakrishnan, MJi, J Syntheses and structure-activity relationship (SAR) studies of 2,5-diazabicyclo[2.2.1]heptanes as novel alpha7 neuronal nicotinic receptor (NNR) ligands. Bioorg Med Chem Lett20:3636-9 (2010) 
 
Neuronal acetylcholine receptor subunit alpha-7
Name:Neuronal acetylcholine receptor subunit alpha-7
Type:Enzyme
Mol. Mass.:56502.44
Organism:Rattus norvegicus (Rat)
Description:Q05941
Residue:502
BDBM50319932
NameBDBM50319932
Synonyms:(1S,4S)-2-(6-phenylpyridazin-3-yl)-2,5-diazabicyclo[2.2.1]heptane | CHEMBL1083280
TypeSmall organic molecule
Emp. Form.C15H16N4
Mol. Mass.252.3143
SMILESC1N[C@H]2C[C@@H]1N(C2)c1ccc(nn1)-c1ccccc1