Reaction Details
TargetNeuronal acetylcholine receptor subunit alpha-7
LigandBDBM50319946
Substrate/Competitorn/a
Meas. Tech.ChEMBL_635043 (CHEMBL1118594)
Ki 61±n/a nM
Citation Li, TBunnelle, WHRyther, KBAnderson, DJMalysz, JHelfrich, RGrønlien, JHHåkerud, MPeters, DSchrimpf, MRGopalakrishnan, MJi, J Syntheses and structure-activity relationship (SAR) studies of 2,5-diazabicyclo[2.2.1]heptanes as novel alpha7 neuronal nicotinic receptor (NNR) ligands. Bioorg Med Chem Lett20:3636-9 (2010) 
 
Neuronal acetylcholine receptor subunit alpha-7
Name:Neuronal acetylcholine receptor subunit alpha-7
Type:Enzyme
Mol. Mass.:56502.44
Organism:Rattus norvegicus (Rat)
Description:Q05941
Residue:502
BDBM50319946
NameBDBM50319946
Synonyms:(1S,4S)-2-(5-(benzofuran-5-yl)pyrazin-2-yl)-5-methyl-2,5-diazabicyclo[2.2.1]heptane | CHEMBL1084021
TypeSmall organic molecule
Emp. Form.C18H18N4O
Mol. Mass.306.3617
SMILESCN1C[C@@H]2C[C@H]1CN2c1cnc(cn1)-c1ccc2occc2c1