Reaction Details
TargetNeuronal acetylcholine receptor subunit alpha-7
LigandBDBM50319955
Substrate/Competitorn/a
Meas. Tech.ChEMBL_635043 (CHEMBL1118594)
Ki 33±n/a nM
Citation Li, TBunnelle, WHRyther, KBAnderson, DJMalysz, JHelfrich, RGrønlien, JHHåkerud, MPeters, DSchrimpf, MRGopalakrishnan, MJi, J Syntheses and structure-activity relationship (SAR) studies of 2,5-diazabicyclo[2.2.1]heptanes as novel alpha7 neuronal nicotinic receptor (NNR) ligands. Bioorg Med Chem Lett20:3636-9 (2010) 
 
Neuronal acetylcholine receptor subunit alpha-7
Name:Neuronal acetylcholine receptor subunit alpha-7
Type:Enzyme
Mol. Mass.:56502.44
Organism:Rattus norvegicus (Rat)
Description:Q05941
Residue:502
BDBM50319955
NameBDBM50319955
Synonyms:(1S,4S)-2-(5-(benzo[b]thiophen-5-yl)pyrimidin-2-yl)-5-methyl-2,5-diazabicyclo[2.2.1]heptane | CHEMBL1085806
TypeSmall organic molecule
Emp. Form.C18H18N4S
Mol. Mass.322.427
SMILESCN1C[C@@H]2C[C@H]1CN2c1ncc(cn1)-c1ccc2sccc2c1