Reaction Details
TargetPotassium voltage-gated channel subfamily H member 2
LigandBDBM50319952
Substrate/Competitorn/a
Meas. Tech.ChEMBL_635046 (CHEMBL1118597)
Ki 9±n/a nM
Citation Li, TBunnelle, WHRyther, KBAnderson, DJMalysz, JHelfrich, RGrønlien, JHHåkerud, MPeters, DSchrimpf, MRGopalakrishnan, MJi, J Syntheses and structure-activity relationship (SAR) studies of 2,5-diazabicyclo[2.2.1]heptanes as novel alpha7 neuronal nicotinic receptor (NNR) ligands. Bioorg Med Chem Lett20:3636-9 (2010) 
 
Potassium voltage-gated channel subfamily H member 2
Name:Potassium voltage-gated channel subfamily H member 2
Type:Multi-pass membrane protein
Mol. Mass.:126672.65
Organism:Homo sapiens (Human)
Description:Q12809
Residue:1159
BDBM50319952
NameBDBM50319952
Synonyms:6-(5-((1S,4S)-5-methyl-2,5-diazabicyclo[2.2.1]heptan-2-yl)pyrazin-2-yl)-1H-indole | CHEMBL1086506
TypeSmall organic molecule
Emp. Form.C18H19N5
Mol. Mass.305.377
SMILESCN1C[C@@H]2C[C@H]1CN2c1cnc(cn1)-c1ccc2cc[nH]c2c1