Reaction Details
TargetPotassium voltage-gated channel subfamily H member 2
LigandBDBM50319964
Substrate/Competitorn/a
Meas. Tech.ChEMBL_635046 (CHEMBL1118597)
Ki 11±n/a nM
Citation Li, TBunnelle, WHRyther, KBAnderson, DJMalysz, JHelfrich, RGrønlien, JHHåkerud, MPeters, DSchrimpf, MRGopalakrishnan, MJi, J Syntheses and structure-activity relationship (SAR) studies of 2,5-diazabicyclo[2.2.1]heptanes as novel alpha7 neuronal nicotinic receptor (NNR) ligands. Bioorg Med Chem Lett20:3636-9 (2010) 
 
Potassium voltage-gated channel subfamily H member 2
Name:Potassium voltage-gated channel subfamily H member 2
Type:Multi-pass membrane protein
Mol. Mass.:126672.65
Organism:Homo sapiens (Human)
Description:Q12809
Residue:1159
BDBM50319964
NameBDBM50319964
Synonyms:5-(6-((1S,4S)-5-methyl-2,5-diazabicyclo[2.2.1]heptan-2-yl)pyridin-3-yl)-1H-indole | CHEMBL1086480
TypeSmall organic molecule
Emp. Form.C19H20N4
Mol. Mass.304.3889
SMILESCN1C[C@@H]2C[C@H]1CN2c1ccc(cn1)-c1ccc2[nH]ccc2c1