Reaction Details
TargetNeuronal acetylcholine receptor subunit alpha-7
LigandBDBM50319957
Substrate/Competitorn/a
Meas. Tech.ChEMBL_635044 (CHEMBL1118595)
EC50 700±n/a nM
Citation Li, TBunnelle, WHRyther, KBAnderson, DJMalysz, JHelfrich, RGrønlien, JHHåkerud, MPeters, DSchrimpf, MRGopalakrishnan, MJi, J Syntheses and structure-activity relationship (SAR) studies of 2,5-diazabicyclo[2.2.1]heptanes as novel alpha7 neuronal nicotinic receptor (NNR) ligands. Bioorg Med Chem Lett20:3636-9 (2010) 
 
Neuronal acetylcholine receptor subunit alpha-7
Name:Neuronal acetylcholine receptor subunit alpha-7
Type:n/a
Mol. Mass.:56448.33
Organism:Homo sapiens (Human)
Description: CHRNA7 (NACHRA7)
Residue:502
BDBM50319957
NameBDBM50319957
Synonyms:5-(2-((1S,4S)-5-methyl-2,5-diazabicyclo[2.2.1]heptan-2-yl)pyrimidin-5-yl)-1H-indole | CHEMBL1086524
TypeSmall organic molecule
Emp. Form.C18H19N5
Mol. Mass.305.377
SMILESCN1C[C@@H]2C[C@H]1CN2c1ncc(cn1)-c1ccc2[nH]ccc2c1