Reaction Details
TargetNeuronal acetylcholine receptor subunit alpha-7
LigandBDBM50319960
Substrate/Competitorn/a
Meas. Tech.ChEMBL_635044 (CHEMBL1118595)
EC50 1800±n/a nM
Citation Li, TBunnelle, WHRyther, KBAnderson, DJMalysz, JHelfrich, RGrønlien, JHHåkerud, MPeters, DSchrimpf, MRGopalakrishnan, MJi, J Syntheses and structure-activity relationship (SAR) studies of 2,5-diazabicyclo[2.2.1]heptanes as novel alpha7 neuronal nicotinic receptor (NNR) ligands. Bioorg Med Chem Lett20:3636-9 (2010) 
 
Neuronal acetylcholine receptor subunit alpha-7
Name:Neuronal acetylcholine receptor subunit alpha-7
Type:n/a
Mol. Mass.:56448.33
Organism:Homo sapiens (Human)
Description: CHRNA7 (NACHRA7)
Residue:502
BDBM50319960
NameBDBM50319960
Synonyms:(1S,4S)-2-methyl-5-(5-phenylpyridin-2-yl)-2,5-diazabicyclo[2.2.1]heptane | CHEMBL1085824
TypeSmall organic molecule
Emp. Form.C17H19N3
Mol. Mass.265.3529
SMILESCN1C[C@@H]2C[C@H]1CN2c1ccc(cn1)-c1ccccc1