Reaction Details
TargetNeuronal acetylcholine receptor subunit alpha-7
LigandBDBM50319965
Substrate/Competitorn/a
Meas. Tech.ChEMBL_635044 (CHEMBL1118595)
EC50 2800±n/a nM
Citation Li, TBunnelle, WHRyther, KBAnderson, DJMalysz, JHelfrich, RGrønlien, JHHåkerud, MPeters, DSchrimpf, MRGopalakrishnan, MJi, J Syntheses and structure-activity relationship (SAR) studies of 2,5-diazabicyclo[2.2.1]heptanes as novel alpha7 neuronal nicotinic receptor (NNR) ligands. Bioorg Med Chem Lett20:3636-9 (2010) 
 
Neuronal acetylcholine receptor subunit alpha-7
Name:Neuronal acetylcholine receptor subunit alpha-7
Type:n/a
Mol. Mass.:56448.33
Organism:Homo sapiens (Human)
Description: CHRNA7 (NACHRA7)
Residue:502
BDBM50319965
NameBDBM50319965
Synonyms:5-(6-((1S,4S)-5-methyl-2,5-diazabicyclo[2.2.1]heptan-2-yl)pyridin-3-yl)-2-(trifluoromethyl)-1H-indole | CHEMBL1086481
TypeSmall organic molecule
Emp. Form.C20H19F3N4
Mol. Mass.372.3869
SMILESCN1C[C@@H]2C[C@H]1CN2c1ccc(cn1)-c1ccc2[nH]c(cc2c1)C(F)(F)F