Reaction Details
TargetSerine/threonine-protein kinase mTOR
LigandBDBM50320103
Substrate/Competitorn/a
Meas. Tech.ChEMBL_635345 (CHEMBL1119658)
IC50 1.3±n/a nM
Citation Zhang, NAyral-Kaloustian, SAnderson, JTNguyen, TDas, SVenkatesan, AMBrooijmans, NLucas, JYu, KHollander, IMallon, R 5-ureidobenzofuranone indoles as potent and efficacious inhibitors of PI3 kinase-alpha and mTOR for the treatment of breast cancer. Bioorg Med Chem Lett20:3526-9 (2010) 
 
Serine/threonine-protein kinase mTOR
Name:Serine/threonine-protein kinase mTOR
Type:Rapamycin target protein
Mol. Mass.:288917.12
Organism:Homo sapiens (Human)
Description:P42345
Residue:2549
BDBM50320103
NameBDBM50320103
Synonyms:1-(2-((5-methoxy-2-(1,3,5-trimethyl-1H-pyrazol-4-yl)-1H-indol-3-yl)methylene)-3-oxo-2,3-dihydrobenzofuran-5-yl)-3-methylurea | CHEMBL1083912
TypeSmall organic molecule
Emp. Form.C26H25N5O4
Mol. Mass.471.5078
SMILESCNC(=O)Nc1ccc2O\C(=C\c3c([nH]c4ccc(OC)cc34)-c3c(C)nn(C)c3C)C(=O)c2c1