Reaction Details
TargetSmoothened homolog
LigandBDBM50320355
Substrate/Competitorn/a
Meas. Tech.ChEMBL_633891 (CHEMBL1120457)
IC50 4.4±n/a nM
Citation Lucas, BSAaron, WAn, SAustin, RJBrown, MChan, HChong, AHungate, RHuang, TJiang, BJohnson, MGKaizerman, JALee, GMcMinn, DLOrf, JPowers, JPRong, MToteva, MMUyeda, CWickramasinghe, DXu, GYe, QZhong, W Design of 1-piperazinyl-4-arylphthalazines as potent Smoothened antagonists. Bioorg Med Chem Lett20:3618-22 (2010) 
 
Smoothened homolog
Name:Smoothened homolog
Type:Protein
Mol. Mass.:86415.51
Organism:Homo sapiens (Human)
Description:Q99835
Residue:787
BDBM50320355
NameBDBM50320355
Synonyms:CHEMBL1085503 | phenyl(4-(4-p-tolylphthalazin-1-yl)piperazin-1-yl)methanone
TypeSmall organic molecule
Emp. Form.C26H24N4O
Mol. Mass.408.495
SMILESCc1ccc(cc1)-c1nnc(N2CCN(CC2)C(=O)c2ccccc2)c2ccccc12