Reaction Details
TargetProstaglandin G/H synthase 1
LigandBDBM50097346
Substrate/Competitorn/a
Meas. Tech.ChEMBL_643266 (CHEMBL1177198)
IC50 13000±n/a nM
Citation Hieke, MNess, JSteri, RDittrich, MGreiner, CWerz, OBaumann, KSchubert-Zsilavecz, MWeggen, SZettl, H Design, synthesis, and biological evaluation of a novel class of gamma-secretase modulators with PPARgamma activity. J Med Chem53:4691-700 (2010) 
 
Prostaglandin G/H synthase 1
Name:Prostaglandin G/H synthase 1
Type:Protein
Mol. Mass.:68868.60
Organism:Ovis aries (Sheep)
Description:n/a
Residue:600
BDBM50097346
NameBDBM50097346
Synonyms:(+/-)-2-(3-chloro-9H-carbazol-7-yl)propanoic acid 2-(6-Chloro-9H-carbazol-2-yl)-propionic acid(carprofen) CARPROFEN Rimadyl | Ro-20-5720/000
TypeSmall organic molecule
Emp. Form.C15H12ClNO2
Mol. Mass.273.714
SMILESCC(C(O)=O)c1ccc2c(c1)[nH]c1ccc(Cl)cc21