Reaction Details
TargetC3a anaphylatoxin chemotactic receptor
LigandBDBM50322652
Substrate/Competitorn/a
Meas. Tech.ChEMBL_642036 (CHEMBL1176068)
IC50 155±n/a nM
Citation Scully, CCBlakeney, JSSingh, RHoang, HNAbbenante, GReid, RCFairlie, DP Selective hexapeptide agonists and antagonists for human complement C3a receptor. J Med Chem53:4938-48 (2010) 
 
C3a anaphylatoxin chemotactic receptor
Name:C3a anaphylatoxin chemotactic receptor
Type:PROTEIN
Mol. Mass.:53864.66
Organism:Homo sapiens (Human)
Description:ChEMBL_642034
Residue:482
BDBM50322652
NameBDBM50322652
Synonyms:(2S,5S,8S,14S,17S)-17-amino-2-(3-guanidinopropyl)-8,14-diisobutyl-5-methyl-4,7,10,13,16-pentaoxo-18-phenyl-3,6,9,12,15-pentaazaoctadecan-1-oic acid | CHEMBL1170639
TypeSmall organic molecule
Emp. Form.C32H53N9O7
Mol. Mass.675.8193
SMILESCC(C)C[C@H](NC(=O)CNC(=O)[C@H](CC(C)C)NC(=O)[C@@H](N)Cc1ccccc1)C(=O)N[C@@H](C)C(=O)N[C@@H](CCCNC(N)=N)C(O)=O