Reaction Details
TargetC3a anaphylatoxin chemotactic receptor
LigandBDBM50322647
Substrate/Competitorn/a
Meas. Tech.ChEMBL_642034 (CHEMBL1176066)
EC50 490±n/a nM
Citation Scully, CCBlakeney, JSSingh, RHoang, HNAbbenante, GReid, RCFairlie, DP Selective hexapeptide agonists and antagonists for human complement C3a receptor. J Med Chem53:4938-48 (2010) 
 
C3a anaphylatoxin chemotactic receptor
Name:C3a anaphylatoxin chemotactic receptor
Type:PROTEIN
Mol. Mass.:53864.66
Organism:Homo sapiens (Human)
Description:ChEMBL_642034
Residue:482
BDBM50322647
NameBDBM50322647
Synonyms:(2S,5S,8S,11S,14S,17S)-14-((1H-indol-3-yl)methyl)-17-amino-2-(3-guanidinopropyl)-11-(hydroxymethyl)-8-isobutyl-5-methyl-4,7,10,13,16-pentaoxo-18-phenyl-3,6,9,12,15-pentaazaoctadecan-1-oic acid | CHEMBL1170636
TypeSmall organic molecule
Emp. Form.C38H54N10O8
Mol. Mass.778.8976
SMILESCC(C)C[C@H](NC(=O)[C@H](CO)NC(=O)[C@H](Cc1c[nH]c2ccccc12)NC(=O)[C@@H](N)Cc1ccccc1)C(=O)N[C@@H](C)C(=O)N[C@@H](CCCN=C(N)N)C(O)=O