Reaction Details
TargetC3a anaphylatoxin chemotactic receptor
LigandBDBM50322640
Substrate/Competitorn/a
Meas. Tech.ChEMBL_642034 (CHEMBL1176066)
EC50 520±n/a nM
Citation Scully, CCBlakeney, JSSingh, RHoang, HNAbbenante, GReid, RCFairlie, DP Selective hexapeptide agonists and antagonists for human complement C3a receptor. J Med Chem53:4938-48 (2010) 
 
C3a anaphylatoxin chemotactic receptor
Name:C3a anaphylatoxin chemotactic receptor
Type:PROTEIN
Mol. Mass.:53864.66
Organism:Homo sapiens (Human)
Description:ChEMBL_642034
Residue:482
BDBM50322640
NameBDBM50322640
Synonyms:(6S,9S,12S,15S,18S,21S)-1-amino-21-benzyl-15-((R)-1-hydroxyethyl)-1-imino-12,18-diisobutyl-9-methyl-8,11,14,17,20,23-hexaoxo-2,7,10,13,16,19,22-heptaazatetracosane-6-carboxylic acid | CHEMBL1170232
TypeSmall organic molecule
Emp. Form.C36H59N9O9
Mol. Mass.761.9086
SMILESCC(C)C[C@H](NC(=O)[C@H](Cc1ccccc1)NC(C)=O)C(=O)N[C@@H]([C@@H](C)O)C(=O)N[C@@H](CC(C)C)C(=O)N[C@@H](C)C(=O)N[C@@H](CCCNC(N)=N)C(O)=O