Reaction Details
TargetAcetylcholinesterase
LigandBDBM50322768
Substrate/Competitorn/a
Meas. Tech.ChEMBL_642381 (CHEMBL1177574)
IC50 1±n/a nM
Citation Fernández-Bachiller, MIPérez, CGonzález-Muñoz, GCConde, SLópez, MGVillarroya, MGarcía, AGRodríguez-Franco, MI Novel tacrine-8-hydroxyquinoline hybrids as multifunctional agents for the treatment of Alzheimer's disease, with neuroprotective, cholinergic, antioxidant, and copper-complexing properties. J Med Chem53:4927-37 (2010) 
 
Acetylcholinesterase
Name:Acetylcholinesterase
Type:Enzyme
Mol. Mass.:67792.70
Organism:Homo sapiens (Human)
Description:P22303
Residue:614
BDBM50322768
NameBDBM50322768
Synonyms:5-Chloro-7-{[9-(1,2,3,4-tetrahydroacridin-9-ylamino)nonylamino]methyl}quinolin-8-ol Dihydrochloride | CHEMBL1172762
TypeSmall organic molecule
Emp. Form.C32H39ClN4O
Mol. Mass.531.131
SMILESOc1c(CNCCCCCCCCCNc2c3CCCCc3nc3ccccc23)cc(Cl)c2cccnc12